Information card for entry 7246690
Chemical name | 2,4-difluoro-6-nitrobenzene-1,3-diamine |
Formula | C6 H5 F2 N3 O2 |
Calculated formula | C6 H5 F2 N3 O2 |
SMILES | Nc1c(N(=O)=O)cc(F)c(N)c1F |
Title of publication | How does the combination of the nitro group and fluorine atoms affect the (co)crystallization behaviour of arylenediamines? |
Authors of publication | Vaganova, Tamara A.; Gatilov, Yurij V.; Kryuchkova, Natalia A.; Pishchur, Denis P.; Zhukovets, Anastasia A.; Malykhin, Evgenij V. |
Journal of publication | CrystEngComm |
Year of publication | 2023 |
Journal volume | 25 |
Journal issue | 22 |
Pages of publication | 3284 - 3298 |
a | 7.6215 ± 0.0004 Å |
b | 3.675 ± 0.0002 Å |
c | 13.2829 ± 0.0007 Å |
α | 90° |
β | 104.936 ± 0.002° |
γ | 90° |
Cell volume | 359.47 ± 0.03 Å3 |
Cell temperature | 296 ± 2 K |
Ambient diffraction temperature | 296 ± 2 K |
Number of distinct elements | 5 |
Space group number | 7 |
Hermann-Mauguin space group symbol | P 1 c 1 |
Hall space group symbol | P -2yc |
Residual factor for all reflections | 0.0282 |
Residual factor for significantly intense reflections | 0.0257 |
Weighted residual factors for significantly intense reflections | 0.0765 |
Weighted residual factors for all reflections included in the refinement | 0.0792 |
Goodness-of-fit parameter for all reflections included in the refinement | 1.035 |
Diffraction radiation wavelength | 0.71073 Å |
Diffraction radiation type | MoKα |