Information card for entry 7246704
Formula | C57 H48 Cu F6 N2 O P3 |
Calculated formula | C57 H48 Cu F6 N2 O P3 |
SMILES | [Cu]12([P](c3ccccc3)(c3c4Oc5c([P]1(c1ccccc1)c1ccccc1)cccc5C(c4ccc3)(C)C)c1ccccc1)[n]1c(CCC#C)cccc1c1[n]2c(CCC#C)ccc1.[P](F)(F)(F)(F)(F)[F-] |
Title of publication | Introducing intramolecular, interligand arene–alkynyl π-interactions into heteroleptic [Cu(N^N)(P^P)]+ complexes |
Authors of publication | Gejsnæs-Schaad, Deyanira; Meyer, Marco; Prescimone, Alessandro; Housecroft, Catherine E.; Constable, Edwin C. |
Journal of publication | CrystEngComm |
Year of publication | 2023 |
Journal volume | 25 |
Journal issue | 20 |
Pages of publication | 3000 - 3012 |
a | 17.0919 ± 0.0003 Å |
b | 14.2952 ± 0.0003 Å |
c | 20.6426 ± 0.0003 Å |
α | 90° |
β | 103.521 ± 0.001° |
γ | 90° |
Cell volume | 4903.86 ± 0.15 Å3 |
Cell temperature | 150 K |
Ambient diffraction temperature | 150 K |
Number of distinct elements | 7 |
Space group number | 14 |
Hermann-Mauguin space group symbol | P 1 21/c 1 |
Hall space group symbol | -P 2ybc |
Residual factor for all reflections | 0.0936 |
Residual factor for significantly intense reflections | 0.0829 |
Weighted residual factors for significantly intense reflections | 0.1745 |
Weighted residual factors for all reflections included in the refinement | 0.1846 |
Goodness-of-fit parameter for all reflections included in the refinement | 1.013 |
Diffraction radiation probe | x-ray |
Diffraction radiation wavelength | 1.54186 Å |
Diffraction radiation type | CuKα |