Information card for entry 7246712
Formula | C24 H28 N2 O7 |
Calculated formula | C24 H28 N2 O7 |
SMILES | O=C(N)c1c(OCC)cccc1.NC(=O)c1c(OCC)cccc1.Oc1cc(O)cc(O)c1 |
Title of publication | Evaluation of synthon influence on ethenzamide–polyphenol pharmaceutical cocrystals |
Authors of publication | Acebedo-Martínez, Francisco Javier; Domínguez-Martín, Alicia; Alarcón-Payer, Carolina; Frontera, Antonio; Ibáñez, Ángel; Choquesillo-Lazarte, Duane |
Journal of publication | CrystEngComm |
Year of publication | 2023 |
Journal volume | 25 |
Journal issue | 21 |
Pages of publication | 3150 - 3163 |
a | 9.931 ± 0.0007 Å |
b | 10.0681 ± 0.0006 Å |
c | 12.1027 ± 0.0008 Å |
α | 90° |
β | 99.78 ± 0.004° |
γ | 90° |
Cell volume | 1192.52 ± 0.14 Å3 |
Cell temperature | 298 ± 2 K |
Ambient diffraction temperature | 298 ± 2 K |
Number of distinct elements | 4 |
Space group number | 7 |
Hermann-Mauguin space group symbol | P 1 n 1 |
Hall space group symbol | P -2yac |
Residual factor for all reflections | 0.0472 |
Residual factor for significantly intense reflections | 0.0404 |
Weighted residual factors for significantly intense reflections | 0.1043 |
Weighted residual factors for all reflections included in the refinement | 0.1108 |
Goodness-of-fit parameter for all reflections included in the refinement | 1.04 |
Diffraction radiation wavelength | 1.54178 Å |
Diffraction radiation type | CuKα |