Information card for entry 7246714
Chemical name | 1,4-diazabicyclo[2,2,2]octane iodine chloride |
Formula | C6 H12 Cl0.95 I1.05 N2 |
Calculated formula | C6 H12 Cl0.9528 I1.0472 N2 |
Title of publication | The relationship between the crystal habit and the energy framework pattern: a case study involving halogen bonding on the edge of a covalent bond |
Authors of publication | Torubaev, Yury V.; Howe, Devin; Leitus, Gregory; Rosokha, Sergiy V. |
Journal of publication | CrystEngComm |
Year of publication | 2023 |
Journal volume | 25 |
Journal issue | 23 |
Pages of publication | 3380 - 3390 |
a | 21.6511 ± 0.0017 Å |
b | 6.9602 ± 0.0006 Å |
c | 5.9635 ± 0.0005 Å |
α | 90° |
β | 90° |
γ | 90° |
Cell volume | 898.68 ± 0.13 Å3 |
Cell temperature | 100 K |
Ambient diffraction temperature | 100 K |
Number of distinct elements | 5 |
Space group number | 62 |
Hermann-Mauguin space group symbol | P n m a |
Hall space group symbol | -P 2ac 2n |
Residual factor for all reflections | 0.049 |
Residual factor for significantly intense reflections | 0.0291 |
Weighted residual factors for significantly intense reflections | 0.0563 |
Weighted residual factors for all reflections included in the refinement | 0.0608 |
Goodness-of-fit parameter for all reflections included in the refinement | 1.046 |
Diffraction radiation wavelength | 0.71073 Å |
Diffraction radiation type | MoKα |