Information card for entry 7246731
Formula | C24 H24 F N3 O |
Calculated formula | C24 H24 F N3 O |
SMILES | Fc1ccc(COc2c(c(cc3cc(nc(N4CCCCC4)c23)C)C)C#N)cc1 |
Title of publication | Crystal structures, dual-state emissions and polymer-based doped room-temperature phosphorescence of 8-benzyloxyisoquinoline derivatives |
Authors of publication | Liu, Miaochang; Xu, Xinyue; Chen, Yating; Ding, Qiuping; Lei, Yunxiang; Wu, Huayue; Huang, Xiaobo |
Journal of publication | CrystEngComm |
Year of publication | 2023 |
Journal volume | 25 |
Journal issue | 22 |
Pages of publication | 3264 - 3270 |
a | 19.673 ± 0.007 Å |
b | 7.589 ± 0.002 Å |
c | 27.281 ± 0.007 Å |
α | 90° |
β | 90° |
γ | 90° |
Cell volume | 4073 ± 2 Å3 |
Cell temperature | 293 ± 2 K |
Ambient diffraction temperature | 293 ± 2 K |
Number of distinct elements | 5 |
Space group number | 61 |
Hermann-Mauguin space group symbol | P b c a |
Hall space group symbol | -P 2ac 2ab |
Residual factor for all reflections | 0.1827 |
Residual factor for significantly intense reflections | 0.0749 |
Weighted residual factors for significantly intense reflections | 0.1566 |
Weighted residual factors for all reflections included in the refinement | 0.2194 |
Goodness-of-fit parameter for all reflections included in the refinement | 1.034 |
Diffraction radiation wavelength | 0.71073 Å |
Diffraction radiation type | MoKα |