Information card for entry 7246733
Formula | C24 H24 Cl N3 O |
Calculated formula | C24 H24 Cl N3 O |
Title of publication | Crystal structures, dual-state emissions and polymer-based doped room-temperature phosphorescence of 8-benzyloxyisoquinoline derivatives |
Authors of publication | Liu, Miaochang; Xu, Xinyue; Chen, Yating; Ding, Qiuping; Lei, Yunxiang; Wu, Huayue; Huang, Xiaobo |
Journal of publication | CrystEngComm |
Year of publication | 2023 |
Journal volume | 25 |
Journal issue | 22 |
Pages of publication | 3264 - 3270 |
a | 10.7226 ± 0.0008 Å |
b | 13.7126 ± 0.0011 Å |
c | 14.8083 ± 0.0013 Å |
α | 90° |
β | 93.229 ± 0.003° |
γ | 90° |
Cell volume | 2173.9 ± 0.3 Å3 |
Cell temperature | 293 ± 2 K |
Ambient diffraction temperature | 293 ± 2 K |
Number of distinct elements | 5 |
Space group number | 4 |
Hermann-Mauguin space group symbol | P 1 21 1 |
Hall space group symbol | P 2yb |
Residual factor for all reflections | 0.0829 |
Residual factor for significantly intense reflections | 0.0486 |
Weighted residual factors for significantly intense reflections | 0.1063 |
Weighted residual factors for all reflections included in the refinement | 0.1262 |
Goodness-of-fit parameter for all reflections included in the refinement | 1.033 |
Diffraction radiation wavelength | 0.71073 Å |
Diffraction radiation type | MoKα |