Information card for entry 7246738
Formula | C25 H24 N4 O |
Calculated formula | C25 H24 N4 O |
SMILES | O(c1c(c(cc2cc(nc(N3CCCCC3)c12)C)C)C#N)Cc1ccc(cc1)C#N |
Title of publication | Crystal structures, dual-state emissions and polymer-based doped room-temperature phosphorescence of 8-benzyloxyisoquinoline derivatives |
Authors of publication | Liu, Miaochang; Xu, Xinyue; Chen, Yating; Ding, Qiuping; Lei, Yunxiang; Wu, Huayue; Huang, Xiaobo |
Journal of publication | CrystEngComm |
Year of publication | 2023 |
Journal volume | 25 |
Journal issue | 22 |
Pages of publication | 3264 - 3270 |
a | 7.8031 ± 0.0003 Å |
b | 10.8097 ± 0.0004 Å |
c | 13.6803 ± 0.0005 Å |
α | 104.082 ± 0.001° |
β | 92.947 ± 0.001° |
γ | 108.109 ± 0.001° |
Cell volume | 1053.66 ± 0.07 Å3 |
Cell temperature | 296 ± 2 K |
Ambient diffraction temperature | 296 ± 2 K |
Number of distinct elements | 4 |
Space group number | 2 |
Hermann-Mauguin space group symbol | P -1 |
Hall space group symbol | -P 1 |
Residual factor for all reflections | 0.0743 |
Residual factor for significantly intense reflections | 0.0577 |
Weighted residual factors for significantly intense reflections | 0.154 |
Weighted residual factors for all reflections included in the refinement | 0.1689 |
Goodness-of-fit parameter for all reflections included in the refinement | 1.061 |
Diffraction radiation wavelength | 0.71073 Å |
Diffraction radiation type | MoKα |