Information card for entry 7246767
Formula | C22 H28 Cu2 N6 O14 |
Calculated formula | C22 H28 Cu2 N6 O14 |
Title of publication | Variations in the structural composition of pyrazole-3,5-dicarboxylato Cu(ii) complexes with 1,2-di(4-pyridyl)ethane synthesized under different conditions |
Authors of publication | Klongdee, Fatima; Chainok, Kittipong; Youngme, Sujittra; Boonmak, Jaursup |
Journal of publication | CrystEngComm |
Year of publication | 2023 |
Journal volume | 25 |
Journal issue | 25 |
Pages of publication | 3628 - 3636 |
a | 8.5539 ± 0.0004 Å |
b | 11.9045 ± 0.0005 Å |
c | 14.8119 ± 0.0007 Å |
α | 95.587 ± 0.001° |
β | 101.681 ± 0.001° |
γ | 107.046 ± 0.001° |
Cell volume | 1392.25 ± 0.11 Å3 |
Cell temperature | 298 ± 2 K |
Ambient diffraction temperature | 298 ± 2 K |
Number of distinct elements | 5 |
Space group number | 2 |
Hermann-Mauguin space group symbol | P -1 |
Hall space group symbol | -P 1 |
Residual factor for all reflections | 0.0754 |
Residual factor for significantly intense reflections | 0.0512 |
Weighted residual factors for significantly intense reflections | 0.1317 |
Weighted residual factors for all reflections included in the refinement | 0.1456 |
Goodness-of-fit parameter for all reflections included in the refinement | 1.052 |
Diffraction radiation wavelength | 0.71073 Å |
Diffraction radiation type | MoKα |