Information card for entry 7246770
Formula | C22 H16 Cu2 N6 O8 |
Calculated formula | C22 H16 Cu2 N6 O8 |
Title of publication | Variations in the structural composition of pyrazole-3,5-dicarboxylato Cu(ii) complexes with 1,2-di(4-pyridyl)ethane synthesized under different conditions |
Authors of publication | Klongdee, Fatima; Chainok, Kittipong; Youngme, Sujittra; Boonmak, Jaursup |
Journal of publication | CrystEngComm |
Year of publication | 2023 |
Journal volume | 25 |
Journal issue | 25 |
Pages of publication | 3628 - 3636 |
a | 7.5089 ± 0.001 Å |
b | 10.85 ± 0.0012 Å |
c | 26.819 ± 0.004 Å |
α | 90° |
β | 90.841 ± 0.004° |
γ | 90° |
Cell volume | 2184.8 ± 0.5 Å3 |
Cell temperature | 298 ± 2 K |
Ambient diffraction temperature | 298 ± 2 K |
Number of distinct elements | 5 |
Space group number | 14 |
Hermann-Mauguin space group symbol | P 1 21/c 1 |
Hall space group symbol | -P 2ybc |
Residual factor for all reflections | 0.1705 |
Residual factor for significantly intense reflections | 0.0744 |
Weighted residual factors for significantly intense reflections | 0.1278 |
Weighted residual factors for all reflections included in the refinement | 0.1598 |
Goodness-of-fit parameter for all reflections included in the refinement | 1.029 |
Diffraction radiation wavelength | 0.71073 Å |
Diffraction radiation type | MoKα |