Information card for entry 7246841
Formula | C36 H69 N31 O49 Tb2 |
Calculated formula | C36 H69 N31 O49 Tb2 |
Title of publication | Supramolecular lanthanide assemblies with cucurbit[6]uril: from synthesis and crystal structure to application |
Authors of publication | Andrienko, Irina V.; Rakhmanova, Mariana I.; Samsonenko, Denis G.; Kovalenko, Ekaterina A. |
Journal of publication | CrystEngComm |
Year of publication | 2023 |
Journal volume | 25 |
Journal issue | 23 |
Pages of publication | 3460 - 3471 |
a | 13.386 ± 0.003 Å |
b | 14.4235 ± 0.0013 Å |
c | 18.1775 ± 0.0013 Å |
α | 73.769 ± 0.002° |
β | 87.34 ± 0.004° |
γ | 87.608 ± 0.005° |
Cell volume | 3364.6 ± 0.8 Å3 |
Cell temperature | 100 ± 2 K |
Ambient diffraction temperature | 100 ± 2 K |
Number of distinct elements | 5 |
Space group number | 2 |
Hermann-Mauguin space group symbol | P -1 |
Hall space group symbol | -P 1 |
Residual factor for all reflections | 0.0387 |
Residual factor for significantly intense reflections | 0.0363 |
Weighted residual factors for significantly intense reflections | 0.0994 |
Weighted residual factors for all reflections included in the refinement | 0.1011 |
Goodness-of-fit parameter for all reflections included in the refinement | 1.067 |
Diffraction radiation wavelength | 0.745 Å |
Diffraction radiation type | synchrotron |