Information card for entry 7246843
Formula | C36 H92 Ho2 N32 O63 |
Calculated formula | C36 H36 Ho2 N32 O62.9978 |
Title of publication | Supramolecular lanthanide assemblies with cucurbit[6]uril: from synthesis and crystal structure to application |
Authors of publication | Andrienko, Irina V.; Rakhmanova, Mariana I.; Samsonenko, Denis G.; Kovalenko, Ekaterina A. |
Journal of publication | CrystEngComm |
Year of publication | 2023 |
Journal volume | 25 |
Journal issue | 23 |
Pages of publication | 3460 - 3471 |
a | 25.8703 ± 0.0006 Å |
b | 25.8703 ± 0.0006 Å |
c | 31.8766 ± 0.0008 Å |
α | 90° |
β | 90° |
γ | 120° |
Cell volume | 18475.9 ± 0.8 Å3 |
Cell temperature | 170 ± 2 K |
Ambient diffraction temperature | 170 ± 2 K |
Number of distinct elements | 5 |
Space group number | 148 |
Hermann-Mauguin space group symbol | R -3 :H |
Hall space group symbol | -R 3 |
Residual factor for all reflections | 0.0346 |
Residual factor for significantly intense reflections | 0.0299 |
Weighted residual factors for significantly intense reflections | 0.0858 |
Weighted residual factors for all reflections included in the refinement | 0.0882 |
Goodness-of-fit parameter for all reflections included in the refinement | 1.058 |
Diffraction radiation probe | x-ray |
Diffraction radiation wavelength | 0.71073 Å |
Diffraction radiation type | MoKα |