Information card for entry 7246863
Formula | C33 H39 Cl3 Fe I N4 O2 |
Calculated formula | C33 H39 Cl3 Fe I N4 O2 |
Title of publication | Light and thermally activated spin crossover coupled to an order–disorder transition of a propyl chain in an iron(iii) complex |
Authors of publication | Boonprab, Theerapoom; Habarakada, Upeksha; Chastanet, Guillaume; Harding, Phimphaka; Harding, David J. |
Journal of publication | CrystEngComm |
Year of publication | 2023 |
Journal volume | 25 |
Journal issue | 29 |
Pages of publication | 4126 - 4132 |
a | 11.47081 ± 0.00014 Å |
b | 12.93413 ± 0.00016 Å |
c | 23.8498 ± 0.0003 Å |
α | 90° |
β | 92.8489 ± 0.0011° |
γ | 90° |
Cell volume | 3534.1 ± 0.08 Å3 |
Cell temperature | 200 ± 0.5 K |
Ambient diffraction temperature | 200 ± 0.5 K |
Number of distinct elements | 7 |
Space group number | 14 |
Hermann-Mauguin space group symbol | P 1 21/c 1 |
Hall space group symbol | -P 2ybc |
Residual factor for all reflections | 0.0573 |
Residual factor for significantly intense reflections | 0.0528 |
Weighted residual factors for significantly intense reflections | 0.1453 |
Weighted residual factors for all reflections included in the refinement | 0.1499 |
Goodness-of-fit parameter for all reflections included in the refinement | 1.09 |
Diffraction radiation wavelength | 1.54184 Å |
Diffraction radiation type | CuKα |