Information card for entry 7246867
Formula | C33 H39 Cl3 Fe I N4 O2 |
Calculated formula | C33 H39 Cl3 Fe I N4 O2 |
Title of publication | Light and thermally activated spin crossover coupled to an order–disorder transition of a propyl chain in an iron(iii) complex |
Authors of publication | Boonprab, Theerapoom; Habarakada, Upeksha; Chastanet, Guillaume; Harding, Phimphaka; Harding, David J. |
Journal of publication | CrystEngComm |
Year of publication | 2023 |
Journal volume | 25 |
Journal issue | 29 |
Pages of publication | 4126 - 4132 |
a | 11.54644 ± 0.00013 Å |
b | 13.04848 ± 0.00016 Å |
c | 23.9438 ± 0.0003 Å |
α | 90° |
β | 93.0092 ± 0.001° |
γ | 90° |
Cell volume | 3602.48 ± 0.08 Å3 |
Cell temperature | 295.9 K |
Ambient diffraction temperature | 295.9 K |
Number of distinct elements | 7 |
Space group number | 14 |
Hermann-Mauguin space group symbol | P 1 21/c 1 |
Hall space group symbol | -P 2ybc |
Residual factor for all reflections | 0.064 |
Residual factor for significantly intense reflections | 0.0552 |
Weighted residual factors for significantly intense reflections | 0.1551 |
Weighted residual factors for all reflections included in the refinement | 0.1632 |
Goodness-of-fit parameter for all reflections included in the refinement | 1.0275 |
Diffraction radiation probe | x-ray |
Diffraction radiation wavelength | 1.54184 Å |
Diffraction radiation type | CuKα |