Information card for entry 7246901
Formula | C16 H18 O2 P S2 Tl |
Calculated formula | C16 H18 O2 P S2 Tl |
SMILES | [Tl]1[S]=P(S1)(Oc1cc(ccc1C)C)Oc1cc(C)ccc1C |
Title of publication | Thallium(i)phosphorodithioates containing intra- and intermolecular π-hole triel bonds |
Authors of publication | Firdoos, Tahira; Kumar, Pretam; Sharma, Nipunn; Gomila, Rosa M.; Frontera, Antonio; Sood, Puneet; Pandey, Sushil K. |
Journal of publication | CrystEngComm |
Year of publication | 2023 |
Journal volume | 25 |
Journal issue | 26 |
Pages of publication | 3777 - 3789 |
a | 25.773 ± 0.0019 Å |
b | 7.57 ± 0.0003 Å |
c | 19.9962 ± 0.0011 Å |
α | 90° |
β | 111.128 ± 0.008° |
γ | 90° |
Cell volume | 3639 ± 0.4 Å3 |
Cell temperature | 150.01 ± 0.1 K |
Ambient diffraction temperature | 150.01 ± 0.1 K |
Number of distinct elements | 6 |
Space group number | 15 |
Hermann-Mauguin space group symbol | C 1 2/c 1 |
Hall space group symbol | -C 2yc |
Residual factor for all reflections | 0.0464 |
Residual factor for significantly intense reflections | 0.0378 |
Weighted residual factors for significantly intense reflections | 0.0996 |
Weighted residual factors for all reflections included in the refinement | 0.1096 |
Goodness-of-fit parameter for all reflections included in the refinement | 0.828 |
Diffraction radiation probe | x-ray |
Diffraction radiation wavelength | 0.71073 Å |
Diffraction radiation type | MoKα |