Information card for entry 7246912
Formula | C5 H10 N2 O6 P2 |
Calculated formula | C5 H10 N2 O6 P2 |
SMILES | P(=O)([O-])(O)P(=O)([O-])O.[nH+]1cc([NH3+])ccc1 |
Title of publication | Structural variety and dehydration in 3-aminopyridine–hypodiphosphoric acid–water system |
Authors of publication | Budzikur-Maciąg, Daria; Kinzhybalo, Vasyl; Ślepokura, Katarzyna |
Journal of publication | CrystEngComm |
Year of publication | 2023 |
Journal volume | 25 |
Journal issue | 26 |
Pages of publication | 3826 - 3836 |
a | 7.327 ± 0.002 Å |
b | 8.018 ± 0.002 Å |
c | 9.174 ± 0.003 Å |
α | 113.48 ± 0.03° |
β | 106.06 ± 0.03° |
γ | 90.3 ± 0.02° |
Cell volume | 470.9 ± 0.3 Å3 |
Cell temperature | 120 ± 2 K |
Ambient diffraction temperature | 120 ± 2 K |
Number of distinct elements | 5 |
Space group number | 2 |
Hermann-Mauguin space group symbol | P -1 |
Hall space group symbol | -P 1 |
Residual factor for all reflections | 0.0577 |
Residual factor for significantly intense reflections | 0.0536 |
Weighted residual factors for significantly intense reflections | 0.1516 |
Weighted residual factors for all reflections included in the refinement | 0.1579 |
Goodness-of-fit parameter for all reflections included in the refinement | 1.07 |
Diffraction radiation wavelength | 0.71073 Å |
Diffraction radiation type | MoKα |