Information card for entry 7246930
Formula | C112 H84 Mn4 N16 O26 |
Calculated formula | C112 H84 Mn4 N16 O26 |
Title of publication | From zero-dimensional metallomacrocycle to three-dimensional metal–organic frameworks mediated by solvent polarity: near-white light emissions and gas adsorption properties |
Authors of publication | Yin, Jia-Ling; Yan, Qing-Qing; Liu, Yu-Xin; Yong, Guo-Ping |
Journal of publication | CrystEngComm |
Year of publication | 2023 |
Journal volume | 25 |
Journal issue | 31 |
Pages of publication | 4435 - 4444 |
a | 37.455 ± 0.0014 Å |
b | 36.5541 ± 0.0014 Å |
c | 11.0255 ± 0.0002 Å |
α | 90° |
β | 90° |
γ | 90° |
Cell volume | 15095.4 ± 0.9 Å3 |
Cell temperature | 293 ± 2 K |
Ambient diffraction temperature | 293 ± 2 K |
Number of distinct elements | 5 |
Space group number | 62 |
Hermann-Mauguin space group symbol | P n m a |
Hall space group symbol | -P 2ac 2n |
Residual factor for all reflections | 0.135 |
Residual factor for significantly intense reflections | 0.0883 |
Weighted residual factors for significantly intense reflections | 0.2529 |
Weighted residual factors for all reflections included in the refinement | 0.2972 |
Goodness-of-fit parameter for all reflections included in the refinement | 0.994 |
Diffraction radiation probe | x-ray |
Diffraction radiation wavelength | 1.54184 Å |
Diffraction radiation type | CuKα |