Information card for entry 7246975
Common name | Cd(PyImPr)2-hlz-beta |
Chemical name | Catena-[bis(β-(3,4-pyridinedicarboximido)propionato)-cadmium] |
Formula | C20 H14 Cd N4 O8 |
Calculated formula | C20 H14 Cd N4 O8 |
Title of publication | Supramolecular isomerism and structural flexibility in coordination networks sustained by cadmium rod building blocks. |
Authors of publication | Andaloussi, Yassin H.; Bezrukov, Andrey A.; Sensharma, Debobroto; Zaworotko, Michael J. |
Journal of publication | CrystEngComm |
Year of publication | 2023 |
Journal volume | 25 |
Journal issue | 29 |
Pages of publication | 4175 - 4181 |
a | 4.9218 ± 0.0002 Å |
b | 18.328 ± 0.0007 Å |
c | 10.9159 ± 0.0005 Å |
α | 90° |
β | 97.893 ± 0.002° |
γ | 90° |
Cell volume | 975.36 ± 0.07 Å3 |
Cell temperature | 100.15 K |
Ambient diffraction temperature | 100.15 K |
Number of distinct elements | 5 |
Space group number | 14 |
Hermann-Mauguin space group symbol | P 1 21/c 1 |
Hall space group symbol | -P 2ybc |
Residual factor for all reflections | 0.0773 |
Residual factor for significantly intense reflections | 0.0757 |
Weighted residual factors for significantly intense reflections | 0.1779 |
Weighted residual factors for all reflections included in the refinement | 0.1785 |
Goodness-of-fit parameter for all reflections included in the refinement | 1.323 |
Diffraction radiation wavelength | 1.54178 Å |
Diffraction radiation type | CuKα |