Information card for entry 7247006
Formula | C66 H48 Eu2 N6 O14 |
Calculated formula | C66 H48 Eu2 N6 O14 |
Title of publication | Designing scintillating coordination polymers using a dual-ligand synthetic approach |
Authors of publication | Arteaga, Ana; Lulich, Alice; Nyman, May; Surbella, Robert G. |
Journal of publication | CrystEngComm |
Year of publication | 2023 |
Journal volume | 25 |
Journal issue | 32 |
Pages of publication | 4496 - 4502 |
a | 11.2602 ± 0.0007 Å |
b | 12.0576 ± 0.0007 Å |
c | 12.2932 ± 0.0007 Å |
α | 78.341 ± 0.003° |
β | 78.639 ± 0.003° |
γ | 63.154 ± 0.003° |
Cell volume | 1447.73 ± 0.15 Å3 |
Cell temperature | 100 ± 2 K |
Ambient diffraction temperature | 100 ± 2 K |
Number of distinct elements | 5 |
Space group number | 2 |
Hermann-Mauguin space group symbol | P -1 |
Hall space group symbol | -P 1 |
Residual factor for all reflections | 0.0719 |
Residual factor for significantly intense reflections | 0.0661 |
Weighted residual factors for significantly intense reflections | 0.1753 |
Weighted residual factors for all reflections included in the refinement | 0.1796 |
Goodness-of-fit parameter for all reflections included in the refinement | 1.147 |
Diffraction radiation probe | x-ray |
Diffraction radiation wavelength | 0.71073 Å |
Diffraction radiation type | MoKα |