Information card for entry 7247009
Formula | C52 H56 Au6 N20 O20 Sm Tb |
Calculated formula | C52 H56 Au5.998 N20 O20 Sm Tb |
Title of publication | Emissive lanthanide dicyanoaurate coordination polymers with 2,2′-bipyridine dioxide antenna groups and their hydration states |
Authors of publication | Brown, Matthew L.; Karpiuk, Thomas E.; Leznoff, Daniel B. |
Journal of publication | CrystEngComm |
Year of publication | 2023 |
Journal volume | 25 |
Journal issue | 33 |
Pages of publication | 4658 - 4668 |
a | 7.8419 ± 0.0006 Å |
b | 19.2528 ± 0.0015 Å |
c | 23.7526 ± 0.0018 Å |
α | 90° |
β | 91.512 ± 0.001° |
γ | 90° |
Cell volume | 3584.9 ± 0.5 Å3 |
Cell temperature | 150 ± 2 K |
Ambient diffraction temperature | 150 ± 2 K |
Number of distinct elements | 7 |
Space group number | 15 |
Hermann-Mauguin space group symbol | C 1 2/c 1 |
Hall space group symbol | -C 2yc |
Residual factor for all reflections | 0.0418 |
Residual factor for significantly intense reflections | 0.0313 |
Weighted residual factors for significantly intense reflections | 0.0652 |
Weighted residual factors for all reflections included in the refinement | 0.0682 |
Goodness-of-fit parameter for all reflections included in the refinement | 1.097 |
Diffraction radiation wavelength | 0.71073 Å |
Diffraction radiation type | MoKα |