Information card for entry 7247012
Formula | C26 H28 Au3 N10 O10 Sm0.41 Tb0.59 |
Calculated formula | C26 H28 Au3 N10 O10 Sm0.403 Tb0.597 |
Title of publication | Emissive lanthanide dicyanoaurate coordination polymers with 2,2′-bipyridine dioxide antenna groups and their hydration states |
Authors of publication | Brown, Matthew L.; Karpiuk, Thomas E.; Leznoff, Daniel B. |
Journal of publication | CrystEngComm |
Year of publication | 2023 |
Journal volume | 25 |
Journal issue | 33 |
Pages of publication | 4658 - 4668 |
a | 7.8699 ± 0.0007 Å |
b | 19.2577 ± 0.0014 Å |
c | 23.7813 ± 0.0017 Å |
α | 90° |
β | 91.485 ± 0.004° |
γ | 90° |
Cell volume | 3603 ± 0.5 Å3 |
Cell temperature | 230 K |
Ambient diffraction temperature | 230 K |
Number of distinct elements | 7 |
Space group number | 15 |
Hermann-Mauguin space group symbol | C 1 2/c 1 |
Hall space group symbol | -C 2yc |
Residual factor for all reflections | 0.0312 |
Residual factor for significantly intense reflections | 0.0249 |
Weighted residual factors for significantly intense reflections | 0.0543 |
Weighted residual factors for all reflections included in the refinement | 0.0564 |
Goodness-of-fit parameter for all reflections included in the refinement | 1.037 |
Diffraction radiation wavelength | 0.71073 Å |
Diffraction radiation type | MoKα |