Information card for entry 7247014
Formula | C26 H26 Au3 N10 O9 Sm0.79 Tb0.22 |
Calculated formula | C26 H26 Au3.0002 N10 O9 Sm0.784 Tb0.216 |
Title of publication | Emissive lanthanide dicyanoaurate coordination polymers with 2,2′-bipyridine dioxide antenna groups and their hydration states |
Authors of publication | Brown, Matthew L.; Karpiuk, Thomas E.; Leznoff, Daniel B. |
Journal of publication | CrystEngComm |
Year of publication | 2023 |
Journal volume | 25 |
Journal issue | 33 |
Pages of publication | 4658 - 4668 |
a | 7.8884 ± 0.0008 Å |
b | 10.2453 ± 0.001 Å |
c | 23.058 ± 0.002 Å |
α | 89.15 ± 0.002° |
β | 85.419 ± 0.002° |
γ | 70.588 ± 0.002° |
Cell volume | 1751.8 ± 0.3 Å3 |
Cell temperature | 150 ± 2 K |
Ambient diffraction temperature | 150 ± 2 K |
Number of distinct elements | 7 |
Space group number | 2 |
Hermann-Mauguin space group symbol | P -1 |
Hall space group symbol | -P 1 |
Residual factor for all reflections | 0.0504 |
Residual factor for significantly intense reflections | 0.0306 |
Weighted residual factors for significantly intense reflections | 0.0434 |
Weighted residual factors for all reflections included in the refinement | 0.0472 |
Goodness-of-fit parameter for all reflections included in the refinement | 1.015 |
Diffraction radiation wavelength | 0.71073 Å |
Diffraction radiation type | MoKα |