Information card for entry 7247016
Formula | C60 H64 Au6 N20 O16 Sm Tb |
Calculated formula | C60 H64 Au6 N20 O16 Sm Tb |
Title of publication | Emissive lanthanide dicyanoaurate coordination polymers with 2,2′-bipyridine dioxide antenna groups and their hydration states |
Authors of publication | Brown, Matthew L.; Karpiuk, Thomas E.; Leznoff, Daniel B. |
Journal of publication | CrystEngComm |
Year of publication | 2023 |
Journal volume | 25 |
Journal issue | 33 |
Pages of publication | 4658 - 4668 |
a | 10.8731 ± 0.0005 Å |
b | 18.0339 ± 0.0009 Å |
c | 19.5988 ± 0.0011 Å |
α | 90° |
β | 99.557 ± 0.002° |
γ | 90° |
Cell volume | 3789.7 ± 0.3 Å3 |
Cell temperature | 150 ± 2 K |
Ambient diffraction temperature | 150 ± 2 K |
Number of distinct elements | 7 |
Space group number | 15 |
Hermann-Mauguin space group symbol | C 1 2/c 1 |
Hall space group symbol | -C 2yc |
Residual factor for all reflections | 0.0201 |
Residual factor for significantly intense reflections | 0.0178 |
Weighted residual factors for significantly intense reflections | 0.0366 |
Weighted residual factors for all reflections included in the refinement | 0.0372 |
Goodness-of-fit parameter for all reflections included in the refinement | 1.096 |
Diffraction radiation wavelength | 0.71073 Å |
Diffraction radiation type | MoKα |