Information card for entry 7247021
Formula | C30 H32 Au3 N10 O8 Tb |
Calculated formula | C30 H32 Au3 N10 O8 Tb |
Title of publication | Emissive lanthanide dicyanoaurate coordination polymers with 2,2′-bipyridine dioxide antenna groups and their hydration states |
Authors of publication | Brown, Matthew L.; Karpiuk, Thomas E.; Leznoff, Daniel B. |
Journal of publication | CrystEngComm |
Year of publication | 2023 |
Journal volume | 25 |
Journal issue | 33 |
Pages of publication | 4658 - 4668 |
a | 10.887 ± 0.0007 Å |
b | 18.0157 ± 0.0013 Å |
c | 19.5884 ± 0.0014 Å |
α | 90° |
β | 99.626 ± 0.003° |
γ | 90° |
Cell volume | 3787.9 ± 0.5 Å3 |
Cell temperature | 150 ± 2 K |
Ambient diffraction temperature | 150 ± 2 K |
Number of distinct elements | 6 |
Space group number | 15 |
Hermann-Mauguin space group symbol | C 1 2/c 1 |
Hall space group symbol | -C 2yc |
Residual factor for all reflections | 0.0438 |
Residual factor for significantly intense reflections | 0.0362 |
Weighted residual factors for significantly intense reflections | 0.1234 |
Weighted residual factors for all reflections included in the refinement | 0.1307 |
Goodness-of-fit parameter for all reflections included in the refinement | 1.047 |
Diffraction radiation probe | x-ray |
Diffraction radiation wavelength | 0.71073 Å |
Diffraction radiation type | MoKα |