Information card for entry 7247035
Formula | C74 H69 Cl4 Co I2 Ir N8 Sn |
Calculated formula | C74 H69 Cl4 Co I2 Ir N8 Sn |
Title of publication | Synthesis, structure and properties of coordination complexes of tin(ii) phthalocyanine and naphthalocyanine with transition metal fragments |
Authors of publication | Faraonov, Maxim A.; Yudanova, Evgeniya I.; Kuzmin, Alexey V.; Khasanov, Salavat S.; Troyanov, Sergey I.; Otsuka, Akihiro; Yamochi, Hideki; Kitagawa, Hiroshi; Konarev, Dmitri V. |
Journal of publication | CrystEngComm |
Year of publication | 2023 |
Journal volume | 25 |
Journal issue | 33 |
Pages of publication | 4620 - 4637 |
a | 22.3297 ± 0.0005 Å |
b | 12.2594 ± 0.0003 Å |
c | 26.799 ± 0.0008 Å |
α | 90° |
β | 110.193 ± 0.003° |
γ | 90° |
Cell volume | 6885.3 ± 0.3 Å3 |
Cell temperature | 150 ± 1 K |
Ambient diffraction temperature | 150 ± 1 K |
Number of distinct elements | 8 |
Space group number | 14 |
Hermann-Mauguin space group symbol | P 1 21/c 1 |
Hall space group symbol | -P 2ybc |
Residual factor for all reflections | 0.0947 |
Residual factor for significantly intense reflections | 0.0804 |
Weighted residual factors for significantly intense reflections | 0.2076 |
Weighted residual factors for all reflections included in the refinement | 0.2176 |
Goodness-of-fit parameter for all reflections included in the refinement | 1.114 |
Diffraction radiation probe | x-ray |
Diffraction radiation wavelength | 0.71073 Å |
Diffraction radiation type | MoKα |