Information card for entry 7247038
Formula | C132 H120 Cl8 Fe2 K2 N20 O20 Sn2 |
Calculated formula | C132 H120 Cl8 Fe2 K2 N20 O20 Sn2 |
Title of publication | Synthesis, structure and properties of coordination complexes of tin(ii) phthalocyanine and naphthalocyanine with transition metal fragments |
Authors of publication | Faraonov, Maxim A.; Yudanova, Evgeniya I.; Kuzmin, Alexey V.; Khasanov, Salavat S.; Troyanov, Sergey I.; Otsuka, Akihiro; Yamochi, Hideki; Kitagawa, Hiroshi; Konarev, Dmitri V. |
Journal of publication | CrystEngComm |
Year of publication | 2023 |
Journal volume | 25 |
Journal issue | 33 |
Pages of publication | 4620 - 4637 |
a | 22.7101 ± 0.0006 Å |
b | 14.5414 ± 0.0008 Å |
c | 39.6766 ± 0.0016 Å |
α | 90° |
β | 90° |
γ | 90° |
Cell volume | 13102.7 ± 1 Å3 |
Cell temperature | 150 ± 2 K |
Ambient diffraction temperature | 150 ± 2 K |
Number of distinct elements | 8 |
Space group number | 29 |
Hermann-Mauguin space group symbol | P c a 21 |
Hall space group symbol | P 2c -2ac |
Residual factor for all reflections | 0.1381 |
Residual factor for significantly intense reflections | 0.0773 |
Weighted residual factors for significantly intense reflections | 0.1367 |
Weighted residual factors for all reflections included in the refinement | 0.1596 |
Goodness-of-fit parameter for all reflections included in the refinement | 1.063 |
Diffraction radiation probe | x-ray |
Diffraction radiation wavelength | 0.71073 Å |
Diffraction radiation type | MoKα |