Information card for entry 7247041
Formula | C23 H30 Cl Mn N2 O11 S |
Calculated formula | C23 H30 Cl Mn N2 O11 S |
Title of publication | An insight into the hydrogen bonding, halogen bonding and chalcogen bonding interactions in manganese(iii) complexes with N2O2donor salicylidine Schiff base ligands |
Authors of publication | Karmakar, Mridul; Sk, Wahedur; Gomila, Rosa M.; Drew, Michael. G. B.; Frontera, Antonio; Chattopadhyay, Shouvik |
Journal of publication | RSC Advances |
Year of publication | 2023 |
Journal volume | 13 |
Journal issue | 31 |
Pages of publication | 21211 - 21224 |
a | 15.4932 ± 0.0006 Å |
b | 17.3487 ± 0.0007 Å |
c | 12.3645 ± 0.0005 Å |
α | 90° |
β | 123.207 ± 0.001° |
γ | 90° |
Cell volume | 2780.69 ± 0.19 Å3 |
Cell temperature | 273 ± 2 K |
Ambient diffraction temperature | 273 ± 2 K |
Number of distinct elements | 7 |
Space group number | 12 |
Hermann-Mauguin space group symbol | C 1 2/m 1 |
Hall space group symbol | -C 2y |
Residual factor for all reflections | 0.0565 |
Residual factor for significantly intense reflections | 0.0534 |
Weighted residual factors for significantly intense reflections | 0.1588 |
Weighted residual factors for all reflections included in the refinement | 0.1623 |
Goodness-of-fit parameter for all reflections included in the refinement | 1.062 |
Diffraction radiation wavelength | 0.71073 Å |
Diffraction radiation type | MoKα |