Information card for entry 7247051
Formula | C14 H15 F3 N2 O3 S |
Calculated formula | C14 H15 F3 N2 O3 S |
SMILES | S(=O)(C)C.FC(F)(F)c1ccc(NC(=O)c2cnoc2C)cc1 |
Title of publication | Role of mechanochemical synthesis in the crystal chemistry of leflunomide |
Authors of publication | Lohar, Vishal A.; Menon, Anila M.; Suresh, Ajay; Chopra, Deepak |
Journal of publication | CrystEngComm |
Year of publication | 2023 |
Journal volume | 25 |
Journal issue | 34 |
Pages of publication | 4779 - 4792 |
a | 7.9976 ± 0.0005 Å |
b | 8.4028 ± 0.0005 Å |
c | 12.3149 ± 0.0008 Å |
α | 75.304 ± 0.003° |
β | 71.879 ± 0.003° |
γ | 81.037 ± 0.003° |
Cell volume | 758.14 ± 0.08 Å3 |
Cell temperature | 100 K |
Ambient diffraction temperature | 100 K |
Number of distinct elements | 6 |
Space group number | 2 |
Hermann-Mauguin space group symbol | P -1 |
Hall space group symbol | -P 1 |
Residual factor for all reflections | 0.0378 |
Residual factor for significantly intense reflections | 0.0338 |
Weighted residual factors for significantly intense reflections | 0.0977 |
Weighted residual factors for all reflections included in the refinement | 0.1002 |
Goodness-of-fit parameter for all reflections included in the refinement | 1.055 |
Diffraction radiation wavelength | 0.71073 Å |
Diffraction radiation type | MoKα |