Information card for entry 7247071
Chemical name | [Co2L1(acac)2]?2MeCN |
Formula | C28 H36 Cl2 Co2 N6 O2 |
Calculated formula | C28 H36 Cl2 Co2 N6 O2 |
Title of publication | Effect of remote substituents and coordination anions on the magnetic properties of Co(ii) dimer complexes |
Authors of publication | Luo, Tong-Kai; Zhong, Xiang; Zhang, Qing-Yun; Chen, Xiao-Feng; Xu, Hui; Peng, Yan; Liu, Sui-Jun; Hu, Zhao-Bo; Wen, He-Rui |
Journal of publication | CrystEngComm |
Year of publication | 2023 |
Journal volume | 25 |
Journal issue | 34 |
Pages of publication | 4873 - 4878 |
a | 7.3125 ± 0.0004 Å |
b | 9.9783 ± 0.0006 Å |
c | 11.6624 ± 0.0007 Å |
α | 71.043 ± 0.002° |
β | 80.28 ± 0.002° |
γ | 77.336 ± 0.002° |
Cell volume | 780.82 ± 0.08 Å3 |
Cell temperature | 293 K |
Ambient diffraction temperature | 293 K |
Number of distinct elements | 6 |
Space group number | 2 |
Hermann-Mauguin space group symbol | P -1 |
Hall space group symbol | -P 1 |
Residual factor for all reflections | 0.0484 |
Residual factor for significantly intense reflections | 0.0404 |
Weighted residual factors for significantly intense reflections | 0.0846 |
Weighted residual factors for all reflections included in the refinement | 0.0915 |
Goodness-of-fit parameter for all reflections included in the refinement | 1.171 |
Diffraction radiation wavelength | 0.71073 Å |
Diffraction radiation type | MoKα |