Information card for entry 7247091
Formula | C124 H128 Au4 Cl6 N8 O12 |
Calculated formula | C124 H126 Au4 Cl6 N8 O12 |
Title of publication | Noncovalent interactions in gold(iii) tetrakis(4-butoxyphenyl)porphyrinate structures |
Authors of publication | Bardina, Elena E.; Makotchenko, Eugeniya V.; Birin, Kirill P.; Baidina, Iraida A.; Sukhikh, Taisiya S.; Novikov, Alexander S.; Gorbunova, Yulia G.; Tsivadze, Aslan Yu.; Gushchin, Artem L. |
Journal of publication | CrystEngComm |
Year of publication | 2023 |
Journal volume | 25 |
Journal issue | 33 |
Pages of publication | 4755 - 4767 |
a | 14.437 ± 0.0007 Å |
b | 18.6296 ± 0.0009 Å |
c | 22.2485 ± 0.0011 Å |
α | 82.428 ± 0.002° |
β | 79.383 ± 0.002° |
γ | 77.623 ± 0.002° |
Cell volume | 5718.1 ± 0.5 Å3 |
Cell temperature | 150 ± 2 K |
Ambient diffraction temperature | 150 ± 2 K |
Number of distinct elements | 6 |
Space group number | 2 |
Hermann-Mauguin space group symbol | P -1 |
Hall space group symbol | -P 1 |
Residual factor for all reflections | 0.0708 |
Residual factor for significantly intense reflections | 0.04 |
Weighted residual factors for significantly intense reflections | 0.0911 |
Weighted residual factors for all reflections included in the refinement | 0.1006 |
Goodness-of-fit parameter for all reflections included in the refinement | 1.085 |
Diffraction radiation wavelength | 0.71073 Å |
Diffraction radiation type | MoKα |