Information card for entry 7247136
Formula | C24 H39 N2 O6 P S |
Calculated formula | C24 H39 N2 O6 P S |
Title of publication | α-Aminophosphonate inhibitors of metallo-β-lactamases NDM-1 and VIM-2 |
Authors of publication | Palica, Katarzyna; Deufel, Fritz; Skagseth, Susann; Di Santo-Meztler, Paula; Thoma, Johannes; Andersson Rasmussen, Anna; Valkonen, Arto; Sunnerhagen, Per; Leiros, Hanna-Kirsti S.; Andersson, Hanna; Erdelyi, Mate |
Journal of publication | RSC Medicinal Chemistry |
Year of publication | 2023 |
a | 18.2265 ± 0.0002 Å |
b | 14.9162 ± 0.0002 Å |
c | 19.3281 ± 0.0002 Å |
α | 90° |
β | 91.281 ± 0.001° |
γ | 90° |
Cell volume | 5253.42 ± 0.11 Å3 |
Cell temperature | 120 ± 2 K |
Ambient diffraction temperature | 120 ± 2 K |
Number of distinct elements | 6 |
Space group number | 14 |
Hermann-Mauguin space group symbol | P 1 21/c 1 |
Hall space group symbol | -P 2ybc |
Residual factor for all reflections | 0.0537 |
Residual factor for significantly intense reflections | 0.0447 |
Weighted residual factors for significantly intense reflections | 0.111 |
Weighted residual factors for all reflections included in the refinement | 0.1191 |
Goodness-of-fit parameter for all reflections included in the refinement | 1.029 |
Diffraction radiation wavelength | 1.54184 Å |
Diffraction radiation type | CuKα |