Information card for entry 7247140
Formula | C24 H39 N2 O6 P S |
Calculated formula | C24 H39 N2 O6 P S |
Title of publication | α-Aminophosphonate inhibitors of metallo-β-lactamases NDM-1 and VIM-2 |
Authors of publication | Palica, Katarzyna; Deufel, Fritz; Skagseth, Susann; Di Santo-Meztler, Paula; Thoma, Johannes; Andersson Rasmussen, Anna; Valkonen, Arto; Sunnerhagen, Per; Leiros, Hanna-Kirsti S.; Andersson, Hanna; Erdelyi, Mate |
Journal of publication | RSC Medicinal Chemistry |
Year of publication | 2023 |
a | 11.3325 ± 0.0001 Å |
b | 14.4994 ± 0.0002 Å |
c | 16.6241 ± 0.0002 Å |
α | 90° |
β | 93.009 ± 0.001° |
γ | 90° |
Cell volume | 2727.81 ± 0.06 Å3 |
Cell temperature | 120 ± 2 K |
Ambient diffraction temperature | 120 ± 2 K |
Number of distinct elements | 6 |
Space group number | 14 |
Hermann-Mauguin space group symbol | P 1 21/n 1 |
Hall space group symbol | -P 2yn |
Residual factor for all reflections | 0.0574 |
Residual factor for significantly intense reflections | 0.0425 |
Weighted residual factors for significantly intense reflections | 0.1002 |
Weighted residual factors for all reflections included in the refinement | 0.1088 |
Goodness-of-fit parameter for all reflections included in the refinement | 1.043 |
Diffraction radiation wavelength | 0.71073 Å |
Diffraction radiation type | MoKα |