Information card for entry 7247142
Formula | C25 H37 N2 O6 P S |
Calculated formula | C25 H37 N2 O6 P S |
Title of publication | α-Aminophosphonate inhibitors of metallo-β-lactamases NDM-1 and VIM-2 |
Authors of publication | Palica, Katarzyna; Deufel, Fritz; Skagseth, Susann; Di Santo-Meztler, Paula; Thoma, Johannes; Andersson Rasmussen, Anna; Valkonen, Arto; Sunnerhagen, Per; Leiros, Hanna-Kirsti S.; Andersson, Hanna; Erdelyi, Mate |
Journal of publication | RSC Medicinal Chemistry |
Year of publication | 2023 |
a | 9.3831 ± 0.0003 Å |
b | 26.8231 ± 0.0006 Å |
c | 11.5306 ± 0.0003 Å |
α | 90° |
β | 107.972 ± 0.003° |
γ | 90° |
Cell volume | 2760.47 ± 0.14 Å3 |
Cell temperature | 120 ± 2 K |
Ambient diffraction temperature | 120 ± 2 K |
Number of distinct elements | 6 |
Space group number | 14 |
Hermann-Mauguin space group symbol | P 1 21/c 1 |
Hall space group symbol | -P 2ybc |
Residual factor for all reflections | 0.0632 |
Residual factor for significantly intense reflections | 0.0464 |
Weighted residual factors for significantly intense reflections | 0.1011 |
Weighted residual factors for all reflections included in the refinement | 0.111 |
Goodness-of-fit parameter for all reflections included in the refinement | 1.061 |
Diffraction radiation wavelength | 0.71073 Å |
Diffraction radiation type | MoKα |