Information card for entry 7247194
Chemical name | catena- [tetrakis(μ6-4,4?4??-[1,3,5-benzenetriyltris(carbonylimino)]-trisbenzoateo)-bis(μ3-oxo)-penta(dimethlyformamide)-triaqua-hepta cadmium isopropanol |
Formula | C106.46 H110.99 Cd4.67 N14.5 O36 |
Calculated formula | C106.467 H110.833 Cd4.66667 N14.5 O36 |
Title of publication | Encapsulation of N-containing compounds in a new hydrophilic Cd-based crystalline sponge via coordinative alignment method |
Authors of publication | Habib, Faiza; Tocher, Derek A.; Carmalt, Claire J. |
Journal of publication | CrystEngComm |
Year of publication | 2023 |
Journal volume | 25 |
Journal issue | 35 |
Pages of publication | 5001 - 5011 |
a | 14.5221 ± 0.0001 Å |
b | 42.7754 ± 0.0002 Å |
c | 33.9548 ± 0.0002 Å |
α | 90° |
β | 93.429 ± 0.001° |
γ | 90° |
Cell volume | 21054.6 ± 0.2 Å3 |
Cell temperature | 150 ± 0.1 K |
Ambient diffraction temperature | 150 ± 0.1 K |
Number of distinct elements | 5 |
Space group number | 14 |
Hermann-Mauguin space group symbol | P 1 21/n 1 |
Hall space group symbol | -P 2yn |
Residual factor for all reflections | 0.0596 |
Residual factor for significantly intense reflections | 0.055 |
Weighted residual factors for significantly intense reflections | 0.1602 |
Weighted residual factors for all reflections included in the refinement | 0.1673 |
Goodness-of-fit parameter for all reflections included in the refinement | 1.035 |
Diffraction radiation probe | x-ray |
Diffraction radiation wavelength | 1.54184 Å |
Diffraction radiation type | CuKα |