Information card for entry 7247231
Formula | C13 H9 Br2 N O |
Calculated formula | C13 H9 Br2 N O |
SMILES | Oc1cc(ccc1/C=N/c1ccc(cc1)Br)Br |
Title of publication | Active control of molecular stacking types in a congeneric library of dihalogenated salicylideneaniline crystals and their solid solutions |
Authors of publication | Yoshikawa, Isao; Zhang, Zaixiang; Suzuki, Masahiro; Ikedo, Hana; Yin, Qiuxiang; Houjou, Hirohiko |
Journal of publication | CrystEngComm |
Year of publication | 2023 |
Journal volume | 25 |
Journal issue | 36 |
Pages of publication | 5109 - 5117 |
a | 6.0569 ± 0.0001 Å |
b | 6.933 ± 0.0001 Å |
c | 28.5038 ± 0.0003 Å |
α | 90° |
β | 90° |
γ | 90° |
Cell volume | 1196.95 ± 0.03 Å3 |
Cell temperature | 93 ± 2 K |
Ambient diffraction temperature | 93 ± 2 K |
Number of distinct elements | 5 |
Space group number | 29 |
Hermann-Mauguin space group symbol | P c a 21 |
Hall space group symbol | P 2c -2ac |
Residual factor for all reflections | 0.0306 |
Residual factor for significantly intense reflections | 0.0306 |
Weighted residual factors for significantly intense reflections | 0.0843 |
Weighted residual factors for all reflections included in the refinement | 0.0843 |
Goodness-of-fit parameter for all reflections included in the refinement | 1.187 |
Diffraction radiation wavelength | 1.54184 Å |
Diffraction radiation type | CuKα |