Information card for entry 7247234
Formula | C13 H9 Br Cl N O |
Calculated formula | C13 H9 Br Cl N O |
Title of publication | Active control of molecular stacking types in a congeneric library of dihalogenated salicylideneaniline crystals and their solid solutions |
Authors of publication | Yoshikawa, Isao; Zhang, Zaixiang; Suzuki, Masahiro; Ikedo, Hana; Yin, Qiuxiang; Houjou, Hirohiko |
Journal of publication | CrystEngComm |
Year of publication | 2023 |
Journal volume | 25 |
Journal issue | 36 |
Pages of publication | 5109 - 5117 |
a | 27.8584 ± 0.0009 Å |
b | 6.8627 ± 0.0003 Å |
c | 6.1547 ± 0.0002 Å |
α | 90° |
β | 95.84 ± 0.003° |
γ | 90° |
Cell volume | 1170.57 ± 0.07 Å3 |
Cell temperature | 93 ± 2 K |
Ambient diffraction temperature | 93 ± 2 K |
Number of distinct elements | 6 |
Space group number | 14 |
Hermann-Mauguin space group symbol | P 1 21/c 1 |
Hall space group symbol | -P 2ybc |
Residual factor for all reflections | 0.075 |
Residual factor for significantly intense reflections | 0.0662 |
Weighted residual factors for significantly intense reflections | 0.1266 |
Weighted residual factors for all reflections included in the refinement | 0.1299 |
Goodness-of-fit parameter for all reflections included in the refinement | 1.174 |
Diffraction radiation wavelength | 0.71073 Å |
Diffraction radiation type | MoKα |