Information card for entry 7247255
Formula | C192 H288 Ag45 Cl6 F24 Sb4 |
Calculated formula | C192 H288 Ag45 Cl6 F24 Sb4 |
Title of publication | Transformations of silver(i) chalcogenide clusters induced by halide ions as dopant components rather than surface active species |
Authors of publication | Gao, Yu-Quan; Wu, Wei-Hong; Mao, Hui; Zhang, Ya-Ge; Zhan, Cai-Hong; Jiang, Zhan-Guo |
Journal of publication | CrystEngComm |
Year of publication | 2023 |
Journal volume | 25 |
Journal issue | 35 |
Pages of publication | 4934 - 4938 |
a | 19.854 ± 0.004 Å |
b | 20.442 ± 0.004 Å |
c | 20.492 ± 0.004 Å |
α | 102.885 ± 0.006° |
β | 116.443 ± 0.005° |
γ | 108.691 ± 0.006° |
Cell volume | 6365 ± 2 Å3 |
Cell temperature | 150 K |
Ambient diffraction temperature | 150 K |
Number of distinct elements | 6 |
Space group number | 2 |
Hermann-Mauguin space group symbol | P -1 |
Hall space group symbol | -P 1 |
Residual factor for all reflections | 0.2004 |
Residual factor for significantly intense reflections | 0.1303 |
Weighted residual factors for significantly intense reflections | 0.3589 |
Weighted residual factors for all reflections included in the refinement | 0.4174 |
Goodness-of-fit parameter for all reflections included in the refinement | 1.352 |
Diffraction radiation wavelength | 0.71073 Å |
Diffraction radiation type | MoKα |