Information card for entry 7247273
Formula | C17 H21 N7 O7 S2 Zn2 |
Calculated formula | C14 H10 N6 O4 S2 Zn2 |
Title of publication | Two flexible zinc–triazole–dicarboxylate frameworks: breathing behaviors for CO2 uptake and dye adsorption properties |
Authors of publication | Liang, Yu-Jie; Liu, Liu; Yao, Jun; Deng, Min; Xu, Quan-Qing; Zhu, Ai-Xin; Huang, Bo |
Journal of publication | CrystEngComm |
Year of publication | 2023 |
Journal volume | 25 |
Journal issue | 36 |
Pages of publication | 5174 - 5183 |
a | 13.3634 ± 0.0004 Å |
b | 13.3634 ± 0.0004 Å |
c | 30.7634 ± 0.0009 Å |
α | 90° |
β | 90° |
γ | 90° |
Cell volume | 5493.7 ± 0.3 Å3 |
Cell temperature | 299 ± 2 K |
Ambient diffraction temperature | 299 ± 2 K |
Number of distinct elements | 6 |
Space group number | 130 |
Hermann-Mauguin space group symbol | P 4/n c c :2 |
Hall space group symbol | -P 4a 2ac |
Residual factor for all reflections | 0.0412 |
Residual factor for significantly intense reflections | 0.0399 |
Weighted residual factors for significantly intense reflections | 0.121 |
Weighted residual factors for all reflections included in the refinement | 0.1221 |
Goodness-of-fit parameter for all reflections included in the refinement | 1.081 |
Diffraction radiation wavelength | 1.54178 Å |
Diffraction radiation type | CuKα |