Information card for entry 7247279
Formula | C7 H7 B O3 |
Calculated formula | C7 H7 B O3 |
Title of publication | Substitution position regulating the excitation-dependent fluorescence–phosphorescence emission of formylphenylboronic acids for single-component white light and anticounterfeiting |
Authors of publication | Li, Guoyan; Yang, Xiaofeng; Miao, Jinling; Cui, Yu; Sun, Guoxin; Li, Yexin |
Journal of publication | CrystEngComm |
Year of publication | 2023 |
Journal volume | 25 |
Journal issue | 38 |
Pages of publication | 5479 - 5485 |
a | 22.75 ± 0.007 Å |
b | 3.8166 ± 0.0011 Å |
c | 17.211 ± 0.005 Å |
α | 90° |
β | 101.691 ± 0.004° |
γ | 90° |
Cell volume | 1463.4 ± 0.7 Å3 |
Cell temperature | 296 ± 2 K |
Ambient diffraction temperature | 296 ± 2 K |
Number of distinct elements | 4 |
Space group number | 15 |
Hermann-Mauguin space group symbol | C 1 2/c 1 |
Hall space group symbol | -C 2yc |
Residual factor for all reflections | 0.0585 |
Residual factor for significantly intense reflections | 0.0439 |
Weighted residual factors for significantly intense reflections | 0.1252 |
Weighted residual factors for all reflections included in the refinement | 0.1377 |
Goodness-of-fit parameter for all reflections included in the refinement | 1.009 |
Diffraction radiation wavelength | 0.71073 Å |
Diffraction radiation type | MoKα |