Information card for entry 7247286
Formula | C7 H10 Cl4 I N |
Calculated formula | C7 H10 Cl4 I N |
Title of publication | Halogen bonding in chloroiodates(iii) |
Authors of publication | Korobeynikov, Nikita A.; Usoltsev, Andrey N.; Sokolov, Maxim N.; Novikov, Alexander S.; Sukhikh, Taisiya S.; Adonin, Sergey A. |
Journal of publication | CrystEngComm |
Year of publication | 2023 |
Journal volume | 25 |
Journal issue | 37 |
Pages of publication | 5233 - 5237 |
a | 8.3175 ± 0.0007 Å |
b | 9.85 ± 0.0005 Å |
c | 7.6668 ± 0.0005 Å |
α | 90° |
β | 101.728 ± 0.007° |
γ | 90° |
Cell volume | 615.01 ± 0.07 Å3 |
Cell temperature | 140 ± 0.1 K |
Ambient diffraction temperature | 140 ± 0.1 K |
Number of distinct elements | 5 |
Space group number | 14 |
Hermann-Mauguin space group symbol | P 1 21/c 1 |
Hall space group symbol | -P 2ybc |
Residual factor for all reflections | 0.0557 |
Residual factor for significantly intense reflections | 0.0392 |
Weighted residual factors for significantly intense reflections | 0.0905 |
Weighted residual factors for all reflections included in the refinement | 0.1035 |
Goodness-of-fit parameter for all reflections included in the refinement | 1.045 |
Diffraction radiation probe | x-ray |
Diffraction radiation wavelength | 0.71073 Å |
Diffraction radiation type | MoKα |