Information card for entry 7247307
Formula | C25 H25 Co N2 O6 |
Calculated formula | C25 H25 Co N2 O6 |
Title of publication | Formation of entangled Co(ii) coordination polymers based on bis-pyridyl-bis-amide and angular dicarboxylate ligands: a structural comparison |
Authors of publication | Huang, Wei-Chun; Chen, Wei-Hao; Chen, Chia-Ling; Liao, Tsung-Te; Chen, Yi-Wun; Chen, Jhy-Der |
Journal of publication | CrystEngComm |
Year of publication | 2023 |
Journal volume | 25 |
Journal issue | 39 |
Pages of publication | 5575 - 5587 |
a | 12.7831 ± 0.0007 Å |
b | 14.0167 ± 0.001 Å |
c | 13.2901 ± 0.001 Å |
α | 90° |
β | 93.441 ± 0.003° |
γ | 90° |
Cell volume | 2377 ± 0.3 Å3 |
Cell temperature | 200 ± 2 K |
Ambient diffraction temperature | 200 ± 2 K |
Number of distinct elements | 5 |
Space group number | 14 |
Hermann-Mauguin space group symbol | P 1 21/c 1 |
Hall space group symbol | -P 2ybc |
Residual factor for all reflections | 0.1117 |
Residual factor for significantly intense reflections | 0.0512 |
Weighted residual factors for significantly intense reflections | 0.0877 |
Weighted residual factors for all reflections included in the refinement | 0.1023 |
Goodness-of-fit parameter for all reflections included in the refinement | 1.023 |
Diffraction radiation wavelength | 0.71073 Å |
Diffraction radiation type | MoKα |