Information card for entry 7247309
Formula | C31 H32 Co N4 O8 |
Calculated formula | C31 H32 Co N4 O8 |
Title of publication | Formation of entangled Co(ii) coordination polymers based on bis-pyridyl-bis-amide and angular dicarboxylate ligands: a structural comparison |
Authors of publication | Huang, Wei-Chun; Chen, Wei-Hao; Chen, Chia-Ling; Liao, Tsung-Te; Chen, Yi-Wun; Chen, Jhy-Der |
Journal of publication | CrystEngComm |
Year of publication | 2023 |
Journal volume | 25 |
Journal issue | 39 |
Pages of publication | 5575 - 5587 |
a | 11.8533 ± 0.0002 Å |
b | 14.3536 ± 0.0003 Å |
c | 18.8237 ± 0.0004 Å |
α | 90° |
β | 94.5365 ± 0.0012° |
γ | 90° |
Cell volume | 3192.58 ± 0.11 Å3 |
Cell temperature | 296 ± 2 K |
Ambient diffraction temperature | 296 ± 2 K |
Number of distinct elements | 5 |
Space group number | 14 |
Hermann-Mauguin space group symbol | P 1 21/c 1 |
Hall space group symbol | -P 2ybc |
Residual factor for all reflections | 0.1117 |
Residual factor for significantly intense reflections | 0.0604 |
Weighted residual factors for significantly intense reflections | 0.1471 |
Weighted residual factors for all reflections included in the refinement | 0.1689 |
Goodness-of-fit parameter for all reflections included in the refinement | 1.03 |
Diffraction radiation wavelength | 0.71073 Å |
Diffraction radiation type | MoKα |