Information card for entry 7247315
Chemical name | 1,3,5-tris(4-iodo-phenoxymethyl)mesitylene |
Formula | C30 H27 I3 O3 |
Calculated formula | C30 H27 I3 O3 |
Title of publication | C–H hydrogen bond and halogen bond directed self-assembly of ethereal podands and C–X⋯F−/HF2− halogen bonding in solution |
Authors of publication | Dutta, Dipjyoti; Gogoi, Anamika; Dutta, Rupjyoti; Harmalkar, Sarvesh S.; Lama, Prem; Dey, Sandeep Kumar |
Journal of publication | CrystEngComm |
Year of publication | 2023 |
Journal volume | 25 |
Journal issue | 40 |
Pages of publication | 5650 - 5659 |
a | 9.645 ± 0.003 Å |
b | 12.616 ± 0.004 Å |
c | 14.168 ± 0.005 Å |
α | 106.195 ± 0.01° |
β | 93.337 ± 0.01° |
γ | 93.16 ± 0.009° |
Cell volume | 1648.2 ± 0.9 Å3 |
Cell temperature | 298 ± 2 K |
Ambient diffraction temperature | 298 ± 2 K |
Number of distinct elements | 4 |
Space group number | 2 |
Hermann-Mauguin space group symbol | P -1 |
Hall space group symbol | -P 1 |
Residual factor for all reflections | 0.1102 |
Residual factor for significantly intense reflections | 0.0798 |
Weighted residual factors for significantly intense reflections | 0.1896 |
Weighted residual factors for all reflections included in the refinement | 0.2059 |
Goodness-of-fit parameter for all reflections included in the refinement | 1.067 |
Diffraction radiation wavelength | 0.71073 Å |
Diffraction radiation type | MoKα |