Information card for entry 7247346
Formula | C62 H46 N2 Ni P2 S4 |
Calculated formula | C62 H46 N2 Ni P2 S4 |
Title of publication | Cyano benzene functionalised Ni and Cu bisdithiolene complexes |
Authors of publication | Costa, António G.; Lopes, Gonçalo; Ribeiro, Susana; Santos, Isabel C.; Simão, Dulce; Pereira, Laura C. J.; Le Breton, Nolwenn; Choua, Sylvie; Baudron, Stéphane A.; Almeida, Manuel; Rabaça, Sandra |
Journal of publication | CrystEngComm |
Year of publication | 2023 |
Journal volume | 25 |
Journal issue | 37 |
Pages of publication | 5362 - 5371 |
a | 9.6337 ± 0.0003 Å |
b | 10.8969 ± 0.0003 Å |
c | 13.2465 ± 0.0004 Å |
α | 80.138 ± 0.001° |
β | 89.456 ± 0.001° |
γ | 87.27 ± 0.001° |
Cell volume | 1368.48 ± 0.07 Å3 |
Cell temperature | 294 ± 2 K |
Ambient diffraction temperature | 294 ± 2 K |
Number of distinct elements | 6 |
Space group number | 2 |
Hermann-Mauguin space group symbol | P -1 |
Hall space group symbol | -P 1 |
Residual factor for all reflections | 0.0482 |
Residual factor for significantly intense reflections | 0.0345 |
Weighted residual factors for significantly intense reflections | 0.0834 |
Weighted residual factors for all reflections included in the refinement | 0.0884 |
Goodness-of-fit parameter for all reflections included in the refinement | 1.042 |
Diffraction radiation wavelength | 0.71073 Å |
Diffraction radiation type | MoKα |