Information card for entry 7247348
Formula | C62 H46 N2 Ni P2 S4 |
Calculated formula | C62 H46 N2 Ni P2 S4 |
Title of publication | Cyano benzene functionalised Ni and Cu bisdithiolene complexes |
Authors of publication | Costa, António G.; Lopes, Gonçalo; Ribeiro, Susana; Santos, Isabel C.; Simão, Dulce; Pereira, Laura C. J.; Le Breton, Nolwenn; Choua, Sylvie; Baudron, Stéphane A.; Almeida, Manuel; Rabaça, Sandra |
Journal of publication | CrystEngComm |
Year of publication | 2023 |
Journal volume | 25 |
Journal issue | 37 |
Pages of publication | 5362 - 5371 |
a | 13.5065 ± 0.0008 Å |
b | 14.3303 ± 0.0009 Å |
c | 14.8428 ± 0.001 Å |
α | 86.334 ± 0.002° |
β | 77.455 ± 0.002° |
γ | 70.668 ± 0.002° |
Cell volume | 2646.1 ± 0.3 Å3 |
Cell temperature | 294 ± 2 K |
Ambient diffraction temperature | 294 ± 2 K |
Number of distinct elements | 6 |
Space group number | 2 |
Hermann-Mauguin space group symbol | P -1 |
Hall space group symbol | -P 1 |
Residual factor for all reflections | 0.1732 |
Residual factor for significantly intense reflections | 0.0675 |
Weighted residual factors for significantly intense reflections | 0.1232 |
Weighted residual factors for all reflections included in the refinement | 0.1466 |
Goodness-of-fit parameter for all reflections included in the refinement | 0.934 |
Diffraction radiation wavelength | 0.71073 Å |
Diffraction radiation type | MoKα |