Information card for entry 7247367
Formula | C32 H77 N O59 P7 W12 Yb |
Calculated formula | C32 H77 N O59 P7 W12 Yb |
Title of publication | Facile fabrication and characterization of rare earth complexes based on Keggin-type polyoxometalate with highly efficient activity for photocatalytic degradation of MO |
Authors of publication | Li, Ying-Yu; Jin, Guan-Yu; Wang, Zhi-Qiang; Hu, Cong; Wang, Xue-Dong; Liu, Jian-Ming; Liu, Min; Han, Hong-Liang; Li, Zhong-Feng; Jin, Qiong-Hua |
Journal of publication | CrystEngComm |
Year of publication | 2023 |
Journal volume | 25 |
Journal issue | 41 |
Pages of publication | 5851 - 5860 |
a | 25.633 ± 0.002 Å |
b | 14.6214 ± 0.0011 Å |
c | 24.546 ± 0.002 Å |
α | 90° |
β | 113.451 ± 0.004° |
γ | 90° |
Cell volume | 8439.7 ± 1.2 Å3 |
Cell temperature | 298 ± 2 K |
Ambient diffraction temperature | 298 ± 2 K |
Number of distinct elements | 7 |
Space group number | 14 |
Hermann-Mauguin space group symbol | P 1 21/c 1 |
Hall space group symbol | -P 2ybc |
Residual factor for all reflections | 0.1408 |
Residual factor for significantly intense reflections | 0.0646 |
Weighted residual factors for significantly intense reflections | 0.1169 |
Weighted residual factors for all reflections included in the refinement | 0.1341 |
Goodness-of-fit parameter for all reflections included in the refinement | 1.08 |
Diffraction radiation wavelength | 0.71073 Å |
Diffraction radiation type | MoKα |