Information card for entry 7247396
Formula | C26 H36 Cu4 I8 N4 |
Calculated formula | C26 H36 Cu4 I8 N4 |
Title of publication | Realizing luminescent from cuprous iodide complexes with high quantum yields by introducing planar aromatic groups and modification with halogen atoms on the ligand |
Authors of publication | Mensah, Abraham; Chen, Wei-Min; Kweku, Ennin Vendish; Liu, Peng-Lai; Shao, Juan-Juan; Wang, Fang-Ming; Chen, Li-Zhuang |
Journal of publication | CrystEngComm |
Year of publication | 2023 |
Journal volume | 25 |
Journal issue | 40 |
Pages of publication | 5722 - 5729 |
a | 7.9774 ± 0.0011 Å |
b | 8.6192 ± 0.0013 Å |
c | 14.768 ± 0.002 Å |
α | 81.554 ± 0.004° |
β | 85.562 ± 0.004° |
γ | 84.147 ± 0.004° |
Cell volume | 997.2 ± 0.2 Å3 |
Cell temperature | 296 ± 2 K |
Ambient diffraction temperature | 296.15 K |
Number of distinct elements | 5 |
Space group number | 2 |
Hermann-Mauguin space group symbol | P -1 |
Hall space group symbol | -P 1 |
Residual factor for all reflections | 0.0584 |
Residual factor for significantly intense reflections | 0.0457 |
Weighted residual factors for significantly intense reflections | 0.1185 |
Weighted residual factors for all reflections included in the refinement | 0.1272 |
Goodness-of-fit parameter for all reflections included in the refinement | 1.04 |
Diffraction radiation wavelength | 0.71073 Å |
Diffraction radiation type | MoKα |