Information card for entry 7247408
Formula | C16 H47 Mo12 N32 Na4 O42 |
Calculated formula | C16 H23 Mo12 N32 Na4 O30 |
Title of publication | Hexnuclear, octanuclear, dodecanuclear, and hexadecnuclear polyoxomolybdenum(v)-based porous materials for selective adsorption of gases |
Authors of publication | Lin, Rong-Yan; Dai, Ru-Dan; Dong, Xin; Zhou, Zhao-Hui |
Journal of publication | CrystEngComm |
Year of publication | 2023 |
Journal volume | 25 |
Journal issue | 42 |
Pages of publication | 5942 - 5950 |
a | 11.8391 ± 0.0003 Å |
b | 11.9219 ± 0.0002 Å |
c | 25.7883 ± 0.0006 Å |
α | 98.134 ± 0.002° |
β | 97.651 ± 0.002° |
γ | 91.857 ± 0.002° |
Cell volume | 3566.31 ± 0.14 Å3 |
Cell temperature | 100 ± 0.1 K |
Ambient diffraction temperature | 100 ± 0.1 K |
Number of distinct elements | 6 |
Space group number | 2 |
Hermann-Mauguin space group symbol | P -1 |
Hall space group symbol | -P 1 |
Residual factor for all reflections | 0.0903 |
Residual factor for significantly intense reflections | 0.0764 |
Weighted residual factors for significantly intense reflections | 0.1987 |
Weighted residual factors for all reflections included in the refinement | 0.2098 |
Goodness-of-fit parameter for all reflections included in the refinement | 1.037 |
Diffraction radiation probe | x-ray |
Diffraction radiation wavelength | 1.54184 Å |
Diffraction radiation type | CuKα |