Information card for entry 7247423
Formula | C23 H23 Cd N5 O7 S |
Calculated formula | C23 H23 Cd N5 O7 S |
Title of publication | Investigation of four Cd(ii) sulfonate complexes: crystal structure, Hirshfeld surface analysis, thermogravimetric and spectroscopic properties |
Authors of publication | Wang, Xueyuan; Carrillo-Aravena, Eduardo; Wu, Yuandong; Mei, Dajiang; Wen, Shaoguo; Doert, Thomas |
Journal of publication | CrystEngComm |
Year of publication | 2023 |
Journal volume | 25 |
Journal issue | 40 |
Pages of publication | 5673 - 5681 |
a | 11.5878 ± 0.0012 Å |
b | 17.7103 ± 0.0012 Å |
c | 13.2737 ± 0.0013 Å |
α | 90° |
β | 114.676 ± 0.012° |
γ | 90° |
Cell volume | 2475.3 ± 0.5 Å3 |
Cell temperature | 100 ± 0.1 K |
Ambient diffraction temperature | 100 ± 0.1 K |
Number of distinct elements | 6 |
Space group number | 14 |
Hermann-Mauguin space group symbol | P 1 21/n 1 |
Hall space group symbol | -P 2yn |
Residual factor for all reflections | 0.0726 |
Residual factor for significantly intense reflections | 0.0587 |
Weighted residual factors for significantly intense reflections | 0.1461 |
Weighted residual factors for all reflections included in the refinement | 0.1531 |
Goodness-of-fit parameter for all reflections included in the refinement | 1.05 |
Diffraction radiation probe | x-ray |
Diffraction radiation wavelength | 0.71073 Å |
Diffraction radiation type | MoKα |