Information card for entry 7247429
Chemical name | 2-(3-(pyren-1-yl)phenyl)benzo[d]thiazole |
Formula | C29 H17 N S |
Calculated formula | C29 H17 N S |
SMILES | s1c(nc2c1cccc2)c1cc(c2c3c4c5c(cc3)cccc5ccc4cc2)ccc1 |
Title of publication | Constructing a pyrene-based dimer in a crystal by adjusting the steric hindrance over the pyrene plane |
Authors of publication | Xia, Zhou-An; Zhang, Xiangyu; Xi, Chang; Bai, Qing; Liu, Haichao; Zhang, Shi-Tong; Yang, Bing |
Journal of publication | CrystEngComm |
Year of publication | 2023 |
Journal volume | 25 |
Journal issue | 41 |
Pages of publication | 5802 - 5809 |
a | 15.7355 ± 0.0006 Å |
b | 8.0029 ± 0.0003 Å |
c | 31.7701 ± 0.0013 Å |
α | 90° |
β | 90° |
γ | 90° |
Cell volume | 4000.8 ± 0.3 Å3 |
Cell temperature | 293 ± 2 K |
Ambient diffraction temperature | 293 K |
Number of distinct elements | 4 |
Space group number | 61 |
Hermann-Mauguin space group symbol | P b c a |
Hall space group symbol | -P 2ac 2ab |
Residual factor for all reflections | 0.1263 |
Residual factor for significantly intense reflections | 0.0904 |
Weighted residual factors for significantly intense reflections | 0.2221 |
Weighted residual factors for all reflections included in the refinement | 0.2562 |
Goodness-of-fit parameter for all reflections included in the refinement | 0.891 |
Diffraction radiation wavelength | 0.71073 Å |
Diffraction radiation type | MoKα |