Information card for entry 7247454
Formula | C18 H12 Cl2 N2 O |
Calculated formula | C18 H12 Cl2 N2 O |
SMILES | c1(cc(c(cc1)Cl)Cl)O.c1ccc2ccc3cccnc3c2n1 |
Title of publication | Dichlorosubstitution as a steering tool in hydrogen bonded cocrystals: the nature of rigid and flexible coformers in crystal structures |
Authors of publication | Dubey, Ritesh; Singh, Sandeep |
Journal of publication | CrystEngComm |
Year of publication | 2023 |
Journal volume | 25 |
Journal issue | 40 |
Pages of publication | 5697 - 5705 |
a | 8.127 ± 0.0015 Å |
b | 8.5365 ± 0.0015 Å |
c | 11.656 ± 0.002 Å |
α | 75.042 ± 0.005° |
β | 86.122 ± 0.006° |
γ | 78.916 ± 0.006° |
Cell volume | 766.5 ± 0.2 Å3 |
Cell temperature | 150 ± 2 K |
Ambient diffraction temperature | 150 ± 2 K |
Number of distinct elements | 5 |
Space group number | 2 |
Hermann-Mauguin space group symbol | P -1 |
Hall space group symbol | -P 1 |
Residual factor for all reflections | 0.0452 |
Residual factor for significantly intense reflections | 0.0367 |
Weighted residual factors for significantly intense reflections | 0.0887 |
Weighted residual factors for all reflections included in the refinement | 0.0928 |
Goodness-of-fit parameter for all reflections included in the refinement | 1.03 |
Diffraction radiation wavelength | 0.71073 Å |
Diffraction radiation type | MoKα |